Reaction Details
TargetKappa-type opioid receptor
LigandBDBM50138001
Substrate/Competitorn/a
Meas. Tech.ChEMBL_146368 (CHEMBL759288)
Ki 6±n/a nM
Citation Zhang, AXiong, WBidlack, JMHilbert, JEKnapp, BIWentland, MPNeumeyer, JL 10-Ketomorphinan and 3-substituted-3-desoxymorphinan analogues as mixed kappa and micro opioid ligands: synthesis and biological evaluation of their binding affinity at opioid receptors. J Med Chem47:165-74 (2003) 
 
Kappa-type opioid receptor
Name:Kappa-type opioid receptor
Type:G Protein-Coupled Receptor (GPCR)
Mol. Mass.:42744.99
Organism:Cavia porcellus (domestic guinea pig)
Description:P41144
Residue:380
BDBM50138001
NameBDBM50138001
Synonyms:3-Cyano-N-cyclobutylmethylmorphinan | CHEMBL48157
TypeSmall organic molecule
Emp. Form.C22H28N2
Mol. Mass.320.4711
SMILESN#Cc1ccc2C[C@@H]3[C@@H]4CCCC[C@]4(CCN3CC3CCC3)c2c1