Reaction Details
TargetKappa-type opioid receptor
LigandBDBM50137998
Substrate/Competitorn/a
Meas. Tech.ChEMBL_146368 (CHEMBL759288)
Ki 7.7±n/a nM
Citation Zhang, AXiong, WBidlack, JMHilbert, JEKnapp, BIWentland, MPNeumeyer, JL 10-Ketomorphinan and 3-substituted-3-desoxymorphinan analogues as mixed kappa and micro opioid ligands: synthesis and biological evaluation of their binding affinity at opioid receptors. J Med Chem47:165-74 (2003) 
 
Kappa-type opioid receptor
Name:Kappa-type opioid receptor
Type:G Protein-Coupled Receptor (GPCR)
Mol. Mass.:42744.99
Organism:Cavia porcellus (domestic guinea pig)
Description:P41144
Residue:380
BDBM50137998
NameBDBM50137998
Synonyms:3-Benzylamino-10-keto-N-cyclobutylmethylmorphinan | CHEMBL49106
TypeSmall organic molecule
Emp. Form.C28H32N2O2
Mol. Mass.428.5659
SMILESO=C(Nc1ccc2C(=O)[C@@H]3[C@@H]4CCCC[C@]4(CCN3CC3CCC3)c2c1)c1ccccc1