Reaction Details
TargetIntegrin alpha-5/beta-1
LigandBDBM50138313
Substrate/Competitorn/a
Meas. Tech.ChEMBL_32643 (CHEMBL642138)
IC50 0.390000±n/a nM
Citation Smallheer, JMWeigelt, CAWoerner, FJWells, JSDaneker, WFMousa, SAWexler, RRJadhav, PK Synthesis and biological evaluation of nonpeptide integrin antagonists containing spirocyclic scaffolds. Bioorg Med Chem Lett14:383-7 (2003) Integrin alpha-5/beta-1
Name:Integrin alpha-5/beta-1
Type:Enzyme
Mol. Mass.:n/a
Description:n/a
Components:This complex has 2 components.
Component 1
Name:Integrin alpha-5
Synonyms:CD49 antigen-like family member E FNRA Fibronectin receptor subunit alpha ITGA5 Integrin alpha-F | VLA-5
Type:Single-pass type I membrane protein
Mol. Mass.:114523.00
Organism:Homo sapiens (Human)
Description:n/a
Residue:1049
Component 2
Name:Integrin beta-1
Synonyms:CD_antigen=CD29 Fibronectin receptor beta GPIIA ITGB1 MDF2 | MSK12
Type:Enzyme
Mol. Mass.:88400.38
Organism:Homo sapiens (Human)
Description:P05556
Residue:798
BDBM50138313
NameBDBM50138313
Synonyms:(5S,8S)-8-[(1H-Benzoimidazol-2-ylamino)-methyl]-3-[(S)-2-carboxy-2-(2,4,6-trimethyl-benzenesulfonylamino)-ethylcarbamoyl]-1-oxa-2,7-diaza-spiro[4.4]non-2-ene-7-carboxylic acid butyl ester | CHEMBL126071
TypeSmall organic molecule
Emp. Form.C32H41N7O8S
Mol. Mass.683.775
SMILESCCCCOC(=O)N1C[C@]2(C[C@H]1CNc1nc3ccccc3[nH]1)CC(=NO2)C(=O)NC[C@H](NS(=O)(=O)c1c(C)cc(C)cc1C)C(O)=O