Reaction Details
TargetAmine oxidase [flavin-containing] A
LigandBDBM11022
Substrate/Competitorn/a
Meas. Tech.ChEMBL_2118497 (CHEMBL4827563)
Ki 16000±n/a nM
Citation Iacovino, LGPinzi, LFacchetti, GBortolini, BChristodoulou, MSBinda, CRastelli, GRimoldi, IPassarella, DDi Paolo, MLDalla Via, L Promising Non-cytotoxic Monosubstituted Chalcones to Target Monoamine Oxidase-B. ACS Med Chem Lett12:1151-1158 (2021) 
 
Amine oxidase [flavin-containing] A
Name:Amine oxidase [flavin-containing] A
Type:Protein
Mol. Mass.:59689.53
Organism:Homo sapiens (Human)
Description:P21397
Residue:527
BDBM11022
NameBDBM11022
Synonyms:2,3-dihydro-1H-indole-2,3-dione Isatin | Isatin (Compound 1)
TypeSmall organic molecule
Emp. Form.C8H5NO2
Mol. Mass.147.1308
SMILESO=C1Nc2ccccc2C1=O