Reaction Details
TargetSodium-dependent serotonin transporter
LigandBDBM50138476
Substrate/Competitorn/a
Meas. Tech.ChEMBL_201354 (CHEMBL806216)
IC50 138±n/a nM
Citation Gilbert, AMStack, GPNilakantan, RKodah, JTran, MScerni, RShi, XSmith, DLAndree, TH Modulation of selective serotonin reuptake inhibitor and 5-HT1A antagonist activity in 8-aza-bicyclo[3.2.1]octane derivatives of 2,3-dihydro-1,4-benzodioxane. Bioorg Med Chem Lett14:515-8 (2003) Sodium-dependent serotonin transporter
Name:Sodium-dependent serotonin transporter
Type:Multi-pass membrane protein
Mol. Mass.:70322.51
Organism:Homo sapiens (Human)
Description:P31645
Residue:630
BDBM50138476
NameBDBM50138476
Synonyms:5-Fluoro-1-[8-((S)-8-methoxy-2,3-dihydro-benzo[1,4]dioxin-2-ylmethyl)-8-aza-bicyclo[3.2.1]oct-2-en-3-yl]-1H-indole | CHEMBL150050
TypeSmall organic molecule
Emp. Form.C25H25FN2O3
Mol. Mass.420.476
SMILESCOc1cccc2OC[C@H](CN3C4CCC3C=C(C4)n3ccc4cc(F)ccc34)Oc12