Reaction Details
Target5-hydroxytryptamine receptor 1A
LigandBDBM50138474
Substrate/Competitorn/a
Meas. Tech.ChEMBL_672 (CHEMBL615748)
IC50 36±n/a nM
Citation Gilbert, AMStack, GPNilakantan, RKodah, JTran, MScerni, RShi, XSmith, DLAndree, TH Modulation of selective serotonin reuptake inhibitor and 5-HT1A antagonist activity in 8-aza-bicyclo[3.2.1]octane derivatives of 2,3-dihydro-1,4-benzodioxane. Bioorg Med Chem Lett14:515-8 (2003) 5-hydroxytryptamine receptor 1A
Name:5-hydroxytryptamine receptor 1A
Type:n/a
Mol. Mass.:46122.49
Organism:Homo sapiens (Human)
Description:n/a
Residue:422
BDBM50138474
NameBDBM50138474
Synonyms:(1R,3R,5S)-3-Benzo[b]thiophen-3-yl-8-((S)-8-methoxy-2,3-dihydro-benzo[1,4]dioxin-2-ylmethyl)-8-aza-bicyclo[3.2.1]octan-3-ol | CHEMBL148860
TypeSmall organic molecule
Emp. Form.C25H27NO4S
Mol. Mass.437.551
SMILESCOc1cccc2OC[C@H](CN3[C@H]4CC[C@@H]3C[C@](O)(C4)c3csc4ccccc34)Oc12