Reaction Details
TargetNischarin
LigandBDBM50138500
Substrate/Competitorn/a
Meas. Tech.ChEBML_220583
Ki 10±n/a nM
Citation Glennon, RAGrella, BTyacke, RJLau, AWestaway, JHudson, AL Binding of an imidazopyridoindole at imidazoline I2 receptors. Bioorg Med Chem Lett14:527-9 (2003) Nischarin
Name:Nischarin
Type:Enzyme
Mol. Mass.:166571.31
Organism:Homo sapiens (Human)
Description:Q9Y2I1
Residue:1504
BDBM50138500
NameBDBM50138500
Synonyms:2-((E)-Styryl)-4,5-dihydro-1H-imidazole CHEMBL275970
TypeSmall organic molecule
Emp. Form.C11H12N2
Mol. Mass.172.2264
SMILESC1CN=C(N1)\C=C\c1ccccc1