Reaction Details
TargetRhomboid protease GlpG
LigandBDBM50572955
Substrate/Competitorn/a
Meas. Tech.ChEMBL_2118695 (CHEMBL4827761)
IC50>1000000±n/a nM
Citation Parsons, WHRutland, NTCrainic, JACardozo, JMChow, ASAndrews, CLSheehan, BK Development of succinimide-based inhibitors for the mitochondrial rhomboid protease PARL. Bioorg Med Chem Lett49:0 (2021) 
 
Rhomboid protease GlpG
Name:Rhomboid protease GlpG
Type:Protein
Mol. Mass.:31313.89
Organism:Escherichia coli (Enterobacteria)
Description:P09391
Residue:276
BDBM50572955
NameBDBM50572955
Synonyms:CHEMBL4861272
TypeSmall organic molecule
Emp. Form.C10H9NO4S
Mol. Mass.239.248
SMILESO=C1CCC(=O)N1S(=O)(=O)c1ccccc1