Reaction Details
TargetCholinesterase
LigandBDBM50138734
Substrate/Competitorn/a
Meas. Tech.ChEMBL_41584 (CHEMBL654878)
IC50 920.0±n/a nM
Citation Ebdrup, SSørensen, LGOlsen, OHJacobsen, P Synthesis and structure-activity relationship for a novel class of potent and selective carbamoyl-triazole based inhibitors of hormone sensitive lipase. J Med Chem47:400-10 (2004) 
 
Cholinesterase
Name:Cholinesterase
Type:Homotetramer
Mol. Mass.:68422.27
Organism:Homo sapiens (Human)
Description:P06276
Residue:602
BDBM50138734
NameBDBM50138734
Synonyms:3-(3-(benzyloxy)phenyl)-5-ethoxy-1,3,4-oxadiazol-2(3H)-one CHEMBL133897
TypeSmall organic molecule
Emp. Form.C17H16N2O4
Mol. Mass.312.3199
SMILESCCOc1nn(-c2cccc(OCc3ccccc3)c2)c(=O)o1