Reaction Details
TargetPancreatic triacylglycerol lipase
LigandBDBM50138734
Substrate/Competitorn/a
Meas. Tech.ChEMBL_152478 (CHEMBL760716)
IC50>10000±n/a nM
Citation Ebdrup, SSørensen, LGOlsen, OHJacobsen, P Synthesis and structure-activity relationship for a novel class of potent and selective carbamoyl-triazole based inhibitors of hormone sensitive lipase. J Med Chem47:400-10 (2004) 
 
Pancreatic triacylglycerol lipase
Name:Pancreatic triacylglycerol lipase
Type:PROTEIN
Mol. Mass.:51157.75
Organism:Homo sapiens (Human)
Description:ChEMBL_527250
Residue:465
BDBM50138734
NameBDBM50138734
Synonyms:3-(3-(benzyloxy)phenyl)-5-ethoxy-1,3,4-oxadiazol-2(3H)-one CHEMBL133897
TypeSmall organic molecule
Emp. Form.C17H16N2O4
Mol. Mass.312.3199
SMILESCCOc1nn(-c2cccc(OCc3ccccc3)c2)c(=O)o1