Reaction Details
TargetHepatic triacylglycerol lipase
LigandBDBM50138739
Substrate/Competitorn/a
Meas. Tech.ChEMBL_100992 (CHEMBL707395)
IC50 1800±n/a nM
Citation Ebdrup, SSørensen, LGOlsen, OHJacobsen, P Synthesis and structure-activity relationship for a novel class of potent and selective carbamoyl-triazole based inhibitors of hormone sensitive lipase. J Med Chem47:400-10 (2004) 
 
Hepatic triacylglycerol lipase
Name:Hepatic triacylglycerol lipase
Type:Protein
Mol. Mass.:55938.55
Organism:Homo sapiens (Human)
Description:P11150
Residue:499
BDBM50138739
NameBDBM50138739
Synonyms:4-tert-Butyl-N-[4-(5-methoxy-2-oxo-[1,3,4]oxadiazol-3-yl)-phenyl]-benzamide CHEMBL339297
TypeSmall organic molecule
Emp. Form.C20H21N3O4
Mol. Mass.367.3984
SMILESCOc1nn(-c2ccc(NC(=O)c3ccc(cc3)C(C)(C)C)cc2)c(=O)o1