Reaction Details
TargetDelta-type opioid receptor
LigandBDBM50010704
Substrate/Competitorn/a
Meas. Tech.ChEMBL_146327 (CHEMBL757535)
Ki 6.18±n/a nM
Citation Vig, BSMurray, TFAldrich, JV Synthesis and opioid activity of side-chain-to-side-chain cyclic dynorphin A-(1-11) amide analogues cyclized between positions 2 and 5. 1. Substitutions in position 3. J Med Chem47:446-55 (2004) 
 
Delta-type opioid receptor
Name:Delta-type opioid receptor
Type:Enzyme Catalytic Domain
Mol. Mass.:40577.25
Organism:MOUSE
Description:P32300
Residue:372
BDBM50010704
NameBDBM50010704
Synonyms:CHEMBL216640 Dynorphin A analogues HTyr-Gly-Gly-Phe-Leu-Arg-Arg-lle-Arg-Pro-LysNH2 Tyr-Gly-Gly-Phe-Leu-Arg-Arg-Ile-Arg-Pro-D-Lys-NH2 | Tyr-Gly-Gly-Phe-Leu-Arg-Arg-Ile-Arg-Pro-Lys-Leu-Lys-Trp-Asp-Asn-Gln-NH2
TypeSmall organic molecule
Emp. Form.C63H104N22O12
Mol. Mass.1361.6401
SMILESCC[C@H](C)[C@H](NC(=O)[C@H](CCCNC(N)=N)NC(=O)[C@H](CCCNC(N)=N)NC(=O)[C@H](CC(C)C)NC(=O)[C@H](Cc1ccccc1)NC(=O)CNC(=O)CNC(=O)[C@@H](N)Cc1ccc(O)cc1)C(=O)N[C@@H](CCCNC(N)=N)C(=O)N1CCC[C@H]1C(=O)N[C@@H](CCCCN)C(N)=O