Reaction Details
TargetMu-type opioid receptor
LigandBDBM50138779
Substrate/Competitorn/a
Meas. Tech.ChEMBL_148864 (CHEMBL756660)
Ki 0.22±n/a nM
Citation Vig, BSMurray, TFAldrich, JV Synthesis and opioid activity of side-chain-to-side-chain cyclic dynorphin A-(1-11) amide analogues cyclized between positions 2 and 5. 1. Substitutions in position 3. J Med Chem47:446-55 (2004) 
 
Mu-type opioid receptor
Name:Mu-type opioid receptor
Type:G Protein-Coupled Receptor (GPCR)
Mol. Mass.:44503.11
Organism:Rattus norvegicus (rat)
Description:Competition binding assays were carried out using membrane preparations from transfected HN9.10 cells that constitutively expressed the mu opioid receptor.
Residue:398
BDBM50138779
NameBDBM50138779
Synonyms:CHEMBL414477 | Linear [D-Asp2,Dap5]Dyn A-(1-11)NH2
TypeSmall organic molecule
Emp. Form.C62H101N23O14
Mol. Mass.1392.611
SMILESCC[C@H](C)[C@H](NC(=O)[C@H](CCCNC(N)=N)NC(=O)[C@H](CCCNC(N)=N)NC(=O)[C@H](CN)NC(=O)[C@H](Cc1ccccc1)NC(=O)CNC(=O)[C@@H](CC(O)=O)NC(=O)[C@@H](N)Cc1ccc(O)cc1)C(=O)N[C@@H](CCCNC(N)=N)C(=O)N1CCC[C@H]1C(=O)N[C@@H](CCCCN)C(N)=O