Reaction Details
TargetKappa-type opioid receptor
LigandBDBM50138769
Substrate/Competitorn/a
Meas. Tech.ChEMBL_145815 (CHEMBL753527)
Ki 6.12±n/a nM
Citation Vig, BSMurray, TFAldrich, JV Synthesis and opioid activity of side-chain-to-side-chain cyclic dynorphin A-(1-11) amide analogues cyclized between positions 2 and 5. 1. Substitutions in position 3. J Med Chem47:446-55 (2004) 
 
Kappa-type opioid receptor
Name:Kappa-type opioid receptor
Type:G Protein-Coupled Receptor (GPCR)
Mol. Mass.:42692.90
Organism:Rattus norvegicus (rat)
Description:P34975
Residue:380
BDBM50138769
NameBDBM50138769
Synonyms:CHEMBL410152 | Linear [D-Ala3]Dyn A-(1-11)NH2
TypeSmall organic molecule
Emp. Form.C63H103N23O14
Mol. Mass.1406.6376
SMILESCC[C@H](C)[C@H](NC(=O)[C@H](CCCNC(N)=N)NC(=O)[C@H](CCCNC(N)=N)NC(=O)[C@H](CN)NC(=O)[C@H](Cc1ccccc1)NC(=O)[C@@H](C)NC(=O)[C@@H](CC(O)=O)NC(=O)[C@@H](N)Cc1ccc(O)cc1)C(=O)N[C@@H](CCCNC(N)=N)C(=O)N1CCC[C@H]1C(=O)N[C@@H](CCCCN)C(N)=O