Reaction Details
TargetCannabinoid receptor 1
LigandBDBM50573086
Substrate/Competitorn/a
Meas. Tech.ChEMBL_2118937 (CHEMBL4828003)
EC50 0.090000±n/a nM
Citation Abdel-Magid, AF Cannabinoid Receptor Agonists for the Potential Treatment of Pain, Neurological Disorders, Fibrotic Diseases, Obesity, and Many More. ACS Med Chem Lett12:1188-1190 (2021) 
 
Cannabinoid receptor 1
Name:Cannabinoid receptor 1
Type:G Protein-Coupled Receptor (GPCR)
Mol. Mass.:52868.96
Organism:Homo sapiens (Human)
Description:P21554
Residue:472
BDBM50573086
NameBDBM50573086
Synonyms:CHEMBL4871491
TypeSmall organic molecule
Emp. Form.C19H25N5O3
Mol. Mass.371.4335
SMILES[H][C@]12CC[C@]([H])(O1)c1c(C2)c(nn1-c1cnccn1)C(=O)N[C@H](CO)C(C)(C)C