Reaction Details
TargetCannabinoid receptor 1
LigandBDBM50573087
Substrate/Competitorn/a
Meas. Tech.ChEMBL_2118937 (CHEMBL4828003)
EC50 0.040000±n/a nM
Citation Abdel-Magid, AF Cannabinoid Receptor Agonists for the Potential Treatment of Pain, Neurological Disorders, Fibrotic Diseases, Obesity, and Many More. ACS Med Chem Lett12:1188-1190 (2021) 
 
Cannabinoid receptor 1
Name:Cannabinoid receptor 1
Type:G Protein-Coupled Receptor (GPCR)
Mol. Mass.:52868.96
Organism:Homo sapiens (Human)
Description:P21554
Residue:472
BDBM50573087
NameBDBM50573087
Synonyms:CHEMBL4862304
TypeSmall organic molecule
Emp. Form.C18H18F3N5O2
Mol. Mass.393.363
SMILESFC(F)(F)C1(CCC1)NC(=O)c1nn(c2C3CCC(Cc12)O3)-c1cnccn1