Reaction Details
TargetCannabinoid receptor 1
LigandBDBM50573088
Substrate/Competitorn/a
Meas. Tech.ChEMBL_2118937 (CHEMBL4828003)
EC50 0.020000±n/a nM
Citation Abdel-Magid, AF Cannabinoid Receptor Agonists for the Potential Treatment of Pain, Neurological Disorders, Fibrotic Diseases, Obesity, and Many More. ACS Med Chem Lett12:1188-1190 (2021) 
 
Cannabinoid receptor 1
Name:Cannabinoid receptor 1
Type:G Protein-Coupled Receptor (GPCR)
Mol. Mass.:52868.96
Organism:Homo sapiens (Human)
Description:P21554
Residue:472
BDBM50573088
NameBDBM50573088
Synonyms:CHEMBL4873473
TypeSmall organic molecule
Emp. Form.C22H25N5O2
Mol. Mass.391.4662
SMILESO=C(NC12CC3CC1CC(C2)C3)c1nn(c2C3CCC(Cc12)O3)-c1cnccn1