Reaction Details
TargetCannabinoid receptor 1
LigandBDBM50573089
Substrate/Competitorn/a
Meas. Tech.ChEMBL_2118937 (CHEMBL4828003)
EC50 0.050000±n/a nM
Citation Abdel-Magid, AF Cannabinoid Receptor Agonists for the Potential Treatment of Pain, Neurological Disorders, Fibrotic Diseases, Obesity, and Many More. ACS Med Chem Lett12:1188-1190 (2021) 
 
Cannabinoid receptor 1
Name:Cannabinoid receptor 1
Type:G Protein-Coupled Receptor (GPCR)
Mol. Mass.:52868.96
Organism:Homo sapiens (Human)
Description:P21554
Residue:472
BDBM50573089
NameBDBM50573089
Synonyms:CHEMBL4846759
TypeSmall organic molecule
Emp. Form.C18H19N5O3
Mol. Mass.353.3752
SMILES[O-][n+]1ccnc(c1)-n1nc(C(=O)NC23CC(C2)C3)c2CC3CCC(O3)c12