Reaction Details
TargetCannabinoid receptor 1
LigandBDBM50573091
Substrate/Competitorn/a
Meas. Tech.ChEMBL_2118937 (CHEMBL4828003)
EC50 0.060000±n/a nM
Citation Abdel-Magid, AF Cannabinoid Receptor Agonists for the Potential Treatment of Pain, Neurological Disorders, Fibrotic Diseases, Obesity, and Many More. ACS Med Chem Lett12:1188-1190 (2021) 
 
Cannabinoid receptor 1
Name:Cannabinoid receptor 1
Type:G Protein-Coupled Receptor (GPCR)
Mol. Mass.:52868.96
Organism:Homo sapiens (Human)
Description:P21554
Residue:472
BDBM50573091
NameBDBM50573091
Synonyms:CHEMBL4865162
TypeSmall organic molecule
Emp. Form.C18H20N6O2S
Mol. Mass.384.455
SMILESCC(C)(C)c1nnc(s1)-c1nn(c2C3CCC(Cc12)O3)-c1c[n+]([O-])ccn1