Reaction Details
TargetCannabinoid receptor 1
LigandBDBM50573094
Substrate/Competitorn/a
Meas. Tech.ChEMBL_2118937 (CHEMBL4828003)
EC50 0.080000±n/a nM
Citation Abdel-Magid, AF Cannabinoid Receptor Agonists for the Potential Treatment of Pain, Neurological Disorders, Fibrotic Diseases, Obesity, and Many More. ACS Med Chem Lett12:1188-1190 (2021) 
 
Cannabinoid receptor 1
Name:Cannabinoid receptor 1
Type:G Protein-Coupled Receptor (GPCR)
Mol. Mass.:52868.96
Organism:Homo sapiens (Human)
Description:P21554
Residue:472
BDBM50573094
NameBDBM50573094
Synonyms:CHEMBL4872695
TypeSmall organic molecule
Emp. Form.C24H25F2N3O2
Mol. Mass.425.471
SMILESFc1ccc(c(F)c1)-n1nc(C(=O)NC23CC4CC2CC(C3)C4)c2CC3CCC(O3)c12