Reaction Details
TargetCannabinoid receptor 2
LigandBDBM50138899
Substrate/Competitorn/a
Meas. Tech.ChEMBL_46977 (CHEMBL659744)
Ki>1000±n/a nM
Citation Lange, JHCoolen, HKvan Stuivenberg, HHDijksman, JAHerremans, AHRonken, EKeizer, HGTipker, KMcCreary, ACVeerman, WWals, HCStork, BVerveer, PCden Hartog, APde Jong, NMAdolfs, TJHoogendoorn, JKruse, CG Synthesis, biological properties, and molecular modeling investigations of novel 3,4-diarylpyrazolines as potent and selective CB(1) cannabinoid receptor antagonists. J Med Chem47:627-43 (2004) 
 
Cannabinoid receptor 2
Name:Cannabinoid receptor 2
Type:G Protein-Coupled Receptor (GPCR)
Mol. Mass.:39690.94
Organism:Homo sapiens (Human)
Description:P34972
Residue:360
BDBM50138899
NameBDBM50138899
Synonyms:3-Chloro-N-[1-[3-(4-chloro-phenyl)-4-phenyl-4,5-dihydro-pyrazol-1-yl]-1-methylamino-meth-(E)-ylidene]-benzenesulfonamide | CHEMBL158537
TypeSmall organic molecule
Emp. Form.C23H20Cl2N4O2S
Mol. Mass.487.402
SMILESCN=C(NS(=O)(=O)c1cccc(Cl)c1)N1CC(C(=N1)c1ccc(Cl)cc1)c1ccccc1