Reaction Details
TargetCannabinoid receptor 2
LigandBDBM50138902
Substrate/Competitorn/a
Meas. Tech.ChEMBL_46977 (CHEMBL659744)
Ki>1000±n/a nM
Citation Lange, JHCoolen, HKvan Stuivenberg, HHDijksman, JAHerremans, AHRonken, EKeizer, HGTipker, KMcCreary, ACVeerman, WWals, HCStork, BVerveer, PCden Hartog, APde Jong, NMAdolfs, TJHoogendoorn, JKruse, CG Synthesis, biological properties, and molecular modeling investigations of novel 3,4-diarylpyrazolines as potent and selective CB(1) cannabinoid receptor antagonists. J Med Chem47:627-43 (2004) 
 
Cannabinoid receptor 2
Name:Cannabinoid receptor 2
Type:G Protein-Coupled Receptor (GPCR)
Mol. Mass.:39690.94
Organism:Homo sapiens (Human)
Description:P34972
Residue:360
BDBM50138902
NameBDBM50138902
Synonyms:CHEMBL160767 | N-[1-Amino-1-[3-(4-chloro-phenyl)-4-phenyl-4,5-dihydro-pyrazol-1-yl]-meth-(E)-ylidene]-4-chloro-benzenesulfonamide
TypeSmall organic molecule
Emp. Form.C22H18Cl2N4O2S
Mol. Mass.473.375
SMILESClc1ccc(cc1)C1=NN(CC1c1ccccc1)C(=N)NS(=O)(=O)c1ccc(Cl)cc1