Reaction Details
TargetCannabinoid receptor 1
LigandBDBM50138915
Substrate/Competitorn/a
Meas. Tech.ChEMBL_46448 (CHEMBL657896)
Ki 35.9±n/a nM
Citation Lange, JHCoolen, HKvan Stuivenberg, HHDijksman, JAHerremans, AHRonken, EKeizer, HGTipker, KMcCreary, ACVeerman, WWals, HCStork, BVerveer, PCden Hartog, APde Jong, NMAdolfs, TJHoogendoorn, JKruse, CG Synthesis, biological properties, and molecular modeling investigations of novel 3,4-diarylpyrazolines as potent and selective CB(1) cannabinoid receptor antagonists. J Med Chem47:627-43 (2004) 
 
Cannabinoid receptor 1
Name:Cannabinoid receptor 1
Type:G Protein-Coupled Receptor (GPCR)
Mol. Mass.:52868.96
Organism:Homo sapiens (Human)
Description:P21554
Residue:472
BDBM50138915
NameBDBM50138915
Synonyms:CHEMBL156264 | N-[1-[(S)-3-(4-Chloro-phenyl)-4-phenyl-4,5-dihydro-pyrazol-1-yl]-1-methylamino-meth-(E)-ylidene]-4-trifluoromethyl-benzenesulfonamide
TypeSmall organic molecule
Emp. Form.C24H20ClF3N4O2S
Mol. Mass.520.954
SMILESCN=C(NS(=O)(=O)c1ccc(cc1)C(F)(F)F)N1C[C@@H](C(=N1)c1ccc(Cl)cc1)c1ccccc1