Reaction Details
TargetCannabinoid receptor 1
LigandBDBM50138919
Substrate/Competitorn/a
Meas. Tech.ChEMBL_46448 (CHEMBL657896)
Ki 52.6±n/a nM
Citation Lange, JHCoolen, HKvan Stuivenberg, HHDijksman, JAHerremans, AHRonken, EKeizer, HGTipker, KMcCreary, ACVeerman, WWals, HCStork, BVerveer, PCden Hartog, APde Jong, NMAdolfs, TJHoogendoorn, JKruse, CG Synthesis, biological properties, and molecular modeling investigations of novel 3,4-diarylpyrazolines as potent and selective CB(1) cannabinoid receptor antagonists. J Med Chem47:627-43 (2004) 
 
Cannabinoid receptor 1
Name:Cannabinoid receptor 1
Type:G Protein-Coupled Receptor (GPCR)
Mol. Mass.:52868.96
Organism:Homo sapiens (Human)
Description:P21554
Residue:472
BDBM50138919
NameBDBM50138919
Synonyms:CHEMBL158502 | N-[1-Amino-1-[3-(4-chloro-phenyl)-4-phenyl-4,5-dihydro-pyrazol-1-yl]-meth-(E)-ylidene]-4-fluoro-benzenesulfonamide
TypeSmall organic molecule
Emp. Form.C22H18ClFN4O2S
Mol. Mass.456.92
SMILESFc1ccc(cc1)S(=O)(=O)NC(=N)N1CC(C(=N1)c1ccc(Cl)cc1)c1ccccc1