Reaction Details
TargetCannabinoid receptor 1
LigandBDBM50138922
Substrate/Competitorn/a
Meas. Tech.ChEMBL_46448 (CHEMBL657896)
Ki>1000±n/a nM
Citation Lange, JHCoolen, HKvan Stuivenberg, HHDijksman, JAHerremans, AHRonken, EKeizer, HGTipker, KMcCreary, ACVeerman, WWals, HCStork, BVerveer, PCden Hartog, APde Jong, NMAdolfs, TJHoogendoorn, JKruse, CG Synthesis, biological properties, and molecular modeling investigations of novel 3,4-diarylpyrazolines as potent and selective CB(1) cannabinoid receptor antagonists. J Med Chem47:627-43 (2004) 
 
Cannabinoid receptor 1
Name:Cannabinoid receptor 1
Type:G Protein-Coupled Receptor (GPCR)
Mol. Mass.:52868.96
Organism:Homo sapiens (Human)
Description:P21554
Residue:472
BDBM50138922
NameBDBM50138922
Synonyms:4-Chloro-N-[3-(4-chloro-phenyl)-4-phenyl-4,5-dihydro-pyrazole-1-carbonyl]-benzenesulfonamide | CHEMBL156027
TypeSmall organic molecule
Emp. Form.C22H17Cl2N3O3S
Mol. Mass.474.36
SMILESClc1ccc(cc1)C1=NN(CC1c1ccccc1)C(=O)NS(=O)(=O)c1ccc(Cl)cc1