Reaction Details
TargetBifunctional dihydrofolate reductase-thymidylate synthase
LigandBDBM50138950
Substrate/Competitorn/a
Meas. Tech.ChEMBL_155801 (CHEMBL765486)
IC50 2800±n/a nM
Citation Kamchonwongpaisan, SQuarrell, RCharoensetakul, NPonsinet, RVilaivan, TVanichtanankul, JTarnchompoo, BSirawaraporn, WLowe, GYuthavong, Y Inhibitors of multiple mutants of Plasmodium falciparum dihydrofolate reductase and their antimalarial activities. J Med Chem47:673-80 (2004) 
 
Bifunctional dihydrofolate reductase-thymidylate synthase
Name:Bifunctional dihydrofolate reductase-thymidylate synthase
Type:Enzyme
Mol. Mass.:71822.51
Organism:Plasmodium falciparum (isolate K1 / Thailand)
Description:The mutant clone was prepared by cassette mutagenesis using wildtype pfDHFR as a template, and expressed in E. coli.
Residue:608
BDBM50138950
NameBDBM50138950
Synonyms:6-(3-(4-chlorophenoxy)phenyl)-1-(4-chlorophenyl)-1,6-dihydro-1,3,5-triazine-2,4-diamine CHEMBL352195
TypeSmall organic molecule
Emp. Form.C21H17Cl2N5O
Mol. Mass.426.299
SMILESNC1=NC(N(C(N)=N1)c1ccc(Cl)cc1)c1cccc(Oc2ccc(Cl)cc2)c1