Reaction Details
TargetBifunctional dihydrofolate reductase-thymidylate synthase
LigandBDBM50110772
Substrate/Competitorn/a
Meas. Tech.ChEMBL_216585 (CHEMBL821377)
Ki 0.7±n/a nM
Citation Kamchonwongpaisan, SQuarrell, RCharoensetakul, NPonsinet, RVilaivan, TVanichtanankul, JTarnchompoo, BSirawaraporn, WLowe, GYuthavong, Y Inhibitors of multiple mutants of Plasmodium falciparum dihydrofolate reductase and their antimalarial activities. J Med Chem47:673-80 (2004) 
 
Bifunctional dihydrofolate reductase-thymidylate synthase
Name:Bifunctional dihydrofolate reductase-thymidylate synthase
Type:Enzyme
Mol. Mass.:71822.51
Organism:Plasmodium falciparum (isolate K1 / Thailand)
Description:The mutant clone was prepared by cassette mutagenesis using wildtype pfDHFR as a template, and expressed in E. coli.
Residue:608
BDBM50110772
NameBDBM50110772
Synonyms:5-(4-Chloro-phenyl)-6-(3-phenyl-propyl)-pyrimidine-2,4-diamine | CHEMBL21691
TypeSmall organic molecule
Emp. Form.C19H19ClN4
Mol. Mass.338.834
SMILESNc1nc(N)c(c(CCCc2ccccc2)n1)-c1ccc(Cl)cc1