Reaction Details
TargetBifunctional dihydrofolate reductase-thymidylate synthase
LigandBDBM50138966
Substrate/Competitorn/a
Meas. Tech.ChEMBL_155801 (CHEMBL765486)
IC50 1100±n/a nM
Citation Kamchonwongpaisan, SQuarrell, RCharoensetakul, NPonsinet, RVilaivan, TVanichtanankul, JTarnchompoo, BSirawaraporn, WLowe, GYuthavong, Y Inhibitors of multiple mutants of Plasmodium falciparum dihydrofolate reductase and their antimalarial activities. J Med Chem47:673-80 (2004) 
 
Bifunctional dihydrofolate reductase-thymidylate synthase
Name:Bifunctional dihydrofolate reductase-thymidylate synthase
Type:Enzyme
Mol. Mass.:71822.51
Organism:Plasmodium falciparum (isolate K1 / Thailand)
Description:The mutant clone was prepared by cassette mutagenesis using wildtype pfDHFR as a template, and expressed in E. coli.
Residue:608
BDBM50138966
NameBDBM50138966
Synonyms:3-(2,6-diamino-5-(3-chlorophenyl)pyrimidin-4-yl)propan-1-ol CHEMBL422005
TypeSmall organic molecule
Emp. Form.C13H15ClN4O
Mol. Mass.278.737
SMILESNc1nc(N)c(c(CCCO)n1)-c1cccc(Cl)c1