Reaction Details
TargetBifunctional dihydrofolate reductase-thymidylate synthase
LigandBDBM18790
Substrate/Competitorn/a
Meas. Tech.ChEMBL_155800 (CHEMBL765485)
IC50 2300±n/a nM
Citation Kamchonwongpaisan, SQuarrell, RCharoensetakul, NPonsinet, RVilaivan, TVanichtanankul, JTarnchompoo, BSirawaraporn, WLowe, GYuthavong, Y Inhibitors of multiple mutants of Plasmodium falciparum dihydrofolate reductase and their antimalarial activities. J Med Chem47:673-80 (2004) 
 
Bifunctional dihydrofolate reductase-thymidylate synthase
Name:Bifunctional dihydrofolate reductase-thymidylate synthase
Type:Enzyme
Mol. Mass.:71822.51
Organism:Plasmodium falciparum (isolate K1 / Thailand)
Description:The mutant clone was prepared by cassette mutagenesis using wildtype pfDHFR as a template, and expressed in E. coli.
Residue:608
BDBM18790
NameBDBM18790
Synonyms:6-hexyl-5-phenylpyrimidine-2,4-diamine P39
TypeSmall organic molecule
Emp. Form.C16H22N4
Mol. Mass.270.3727
SMILESCCCCCCc1nc(N)nc(N)c1-c1ccccc1