Reaction Details
TargetBifunctional dihydrofolate reductase-thymidylate synthase
LigandBDBM18791
Substrate/Competitorn/a
Meas. Tech.ChEMBL_155798 (CHEMBL760860)
IC50 2700±n/a nM
Citation Kamchonwongpaisan, SQuarrell, RCharoensetakul, NPonsinet, RVilaivan, TVanichtanankul, JTarnchompoo, BSirawaraporn, WLowe, GYuthavong, Y Inhibitors of multiple mutants of Plasmodium falciparum dihydrofolate reductase and their antimalarial activities. J Med Chem47:673-80 (2004) 
 
Bifunctional dihydrofolate reductase-thymidylate synthase
Name:Bifunctional dihydrofolate reductase-thymidylate synthase
Type:Enzyme
Mol. Mass.:71822.51
Organism:Plasmodium falciparum (isolate K1 / Thailand)
Description:The mutant clone was prepared by cassette mutagenesis using wildtype pfDHFR as a template, and expressed in E. coli.
Residue:608
BDBM18791
NameBDBM18791
Synonyms:5-phenyl-6-(3-phenylpropyl)pyrimidine-2,4-diamine P33
TypeSmall organic molecule
Emp. Form.C19H20N4
Mol. Mass.304.3889
SMILESNc1nc(N)c(-c2ccccc2)c(CCCc2ccccc2)n1