Reaction Details
TargetBifunctional dihydrofolate reductase-thymidylate synthase
LigandBDBM50138955
Substrate/Competitorn/a
Meas. Tech.ChEMBL_155801 (CHEMBL765486)
IC50 3000±n/a nM
Citation Kamchonwongpaisan, SQuarrell, RCharoensetakul, NPonsinet, RVilaivan, TVanichtanankul, JTarnchompoo, BSirawaraporn, WLowe, GYuthavong, Y Inhibitors of multiple mutants of Plasmodium falciparum dihydrofolate reductase and their antimalarial activities. J Med Chem47:673-80 (2004) 
 
Bifunctional dihydrofolate reductase-thymidylate synthase
Name:Bifunctional dihydrofolate reductase-thymidylate synthase
Type:Enzyme
Mol. Mass.:71822.51
Organism:Plasmodium falciparum (isolate K1 / Thailand)
Description:The mutant clone was prepared by cassette mutagenesis using wildtype pfDHFR as a template, and expressed in E. coli.
Residue:608
BDBM50138955
NameBDBM50138955
Synonyms:1-(3-Chloro-phenyl)-6-{3-[3-(2,4,5-trichloro-phenoxy)-propoxy]-phenyl}-1,6-dihydro-[1,3,5]triazine-2,4-diamine CHEMBL159052
TypeSmall organic molecule
Emp. Form.C24H21Cl4N5O2
Mol. Mass.553.268
SMILESNC1=NC(N(C(N)=N1)c1cccc(Cl)c1)c1cccc(OCCCOc2cc(Cl)c(Cl)cc2Cl)c1