Reaction Details
TargetBifunctional dihydrofolate reductase-thymidylate synthase
LigandBDBM18786
Substrate/Competitorn/a
Meas. Tech.ChEMBL_155801 (CHEMBL765486)
IC50 670.0±n/a nM
Citation Kamchonwongpaisan, SQuarrell, RCharoensetakul, NPonsinet, RVilaivan, TVanichtanankul, JTarnchompoo, BSirawaraporn, WLowe, GYuthavong, Y Inhibitors of multiple mutants of Plasmodium falciparum dihydrofolate reductase and their antimalarial activities. J Med Chem47:673-80 (2004) 
 
Bifunctional dihydrofolate reductase-thymidylate synthase
Name:Bifunctional dihydrofolate reductase-thymidylate synthase
Type:Enzyme
Mol. Mass.:71822.51
Organism:Plasmodium falciparum (isolate K1 / Thailand)
Description:The mutant clone was prepared by cassette mutagenesis using wildtype pfDHFR as a template, and expressed in E. coli.
Residue:608
BDBM18786
NameBDBM18786
Synonyms:5-(3-chlorophenyl)-6-(3-phenylpropyl)pyrimidine-2,4-diamine P31
TypeSmall organic molecule
Emp. Form.C19H19ClN4
Mol. Mass.338.834
SMILESNc1nc(N)c(c(CCCc2ccccc2)n1)-c1cccc(Cl)c1