Reaction Details
TargetBifunctional dihydrofolate reductase-thymidylate synthase
LigandBDBM50090063
Substrate/Competitorn/a
Meas. Tech.ChEMBL_155801 (CHEMBL765486)
IC50 560.0±n/a nM
Citation Kamchonwongpaisan, SQuarrell, RCharoensetakul, NPonsinet, RVilaivan, TVanichtanankul, JTarnchompoo, BSirawaraporn, WLowe, GYuthavong, Y Inhibitors of multiple mutants of Plasmodium falciparum dihydrofolate reductase and their antimalarial activities. J Med Chem47:673-80 (2004) 
 
Bifunctional dihydrofolate reductase-thymidylate synthase
Name:Bifunctional dihydrofolate reductase-thymidylate synthase
Type:Enzyme
Mol. Mass.:71822.51
Organism:Plasmodium falciparum (isolate K1 / Thailand)
Description:The mutant clone was prepared by cassette mutagenesis using wildtype pfDHFR as a template, and expressed in E. coli.
Residue:608
BDBM50090063
NameBDBM50090063
Synonyms:1-(3-Chloro-phenyl)-6-phenyl-1,6-dihydro-[1,3,5]triazine-2,4-diamine CHEMBL329687
TypeSmall organic molecule
Emp. Form.C15H14ClN5
Mol. Mass.299.758
SMILESNC1=NC(N(C(N)=N1)c1cccc(Cl)c1)c1ccccc1