Reaction Details
TargetMu-type opioid receptor
LigandBDBM50139018
Substrate/Competitorn/a
Meas. Tech.ChEMBL_149017 (CHEMBL758581)
Ki 0.8±n/a nM
Citation Tömböly, CKövér, KEPéter, ATourwé, DBiyashev, DBenyhe, SBorsodi, AAl-Khrasani, MRónai, AZTóth, G Structure-activity study on the Phe side chain arrangement of endomorphins using conformationally constrained analogues. J Med Chem47:735-43 (2004) 
 
Mu-type opioid receptor
Name:Mu-type opioid receptor
Type:G Protein-Coupled Receptor (GPCR)
Mol. Mass.:44503.11
Organism:Rattus norvegicus (rat)
Description:Competition binding assays were carried out using membrane preparations from transfected HN9.10 cells that constitutively expressed the mu opioid receptor.
Residue:398
BDBM50139018
NameBDBM50139018
Synonyms:(S)-1-[(S)-2-Amino-3-(4-hydroxy-phenyl)-propionyl]-pyrrolidine-2-carboxylic acid [(S)-1-((1S,2S)-1-carbamoyl-2-phenyl-propylcarbamoyl)-2-(1H-indol-3-yl)-ethyl]-amide | CHEMBL166312
TypeSmall organic molecule
Emp. Form.C35H40N6O5
Mol. Mass.624.7293
SMILESC[C@H]([C@H](NC(=O)[C@H](Cc1c[nH]c2ccccc12)NC(=O)[C@@H]1CCCN1C(=O)[C@@H](N)Cc1ccc(O)cc1)C(N)=O)c1ccccc1