Reaction Details
TargetProstaglandin G/H synthase 1
LigandBDBM50074933
Substrate/Competitorn/a
Meas. Tech.ChEBML_159410
IC50 32±n/a nM
Citation Gupta, KKaub, CJCarey, KNCasillas, EGSelinsky, BSLoll, PJ Manipulation of kinetic profiles in 2-aryl propionic acid cyclooxygenase inhibitors. Bioorg Med Chem Lett14:667-71 (2004) Prostaglandin G/H synthase 1
Name:Prostaglandin G/H synthase 1
Type:Protein
Mol. Mass.:68868.60
Organism:Ovis aries (Sheep)
Description:n/a
Residue:600
BDBM50074933
NameBDBM50074933
Synonyms:2-biphenyl-4-yl-propionic acid alpha-Methyl-4-biphenyl-acetic acid
TypeSmall organic molecule
Emp. Form.C15H14O2
Mol. Mass.226.2705
SMILESCC(C(O)=O)c1ccc(cc1)-c1ccccc1