Reaction Details
Target5-hydroxytryptamine receptor 1A
LigandBDBM50139353
Substrate/Competitorn/a
Meas. Tech.ChEBML_912
Ki 17±n/a nM
Citation Thomson, CGBeer, MSCurtis, NRDiggle, HJHandford, EKulagowski, JJ Thiazoles and thiopyridines: novel series of high affinity h5HT(7) ligands. Bioorg Med Chem Lett14:677-80 (2004) 5-hydroxytryptamine receptor 1A
Name:5-hydroxytryptamine receptor 1A
Type:n/a
Mol. Mass.:46122.49
Organism:Homo sapiens (Human)
Description:n/a
Residue:422
BDBM50139353
NameBDBM50139353
Synonyms:(2-tert-Butylsulfanyl-ethyl)-dimethyl-amine | CHEMBL158973
TypeSmall organic molecule
Emp. Form.C8H19NS
Mol. Mass.161.308
SMILESCN(C)CCSC(C)(C)C