Reaction Details
Target5-hydroxytryptamine receptor 7
LigandBDBM50139353
Substrate/Competitorn/a
Meas. Tech.ChEBML_3690
Ki 1.3±n/a nM
Citation Thomson, CGBeer, MSCurtis, NRDiggle, HJHandford, EKulagowski, JJ Thiazoles and thiopyridines: novel series of high affinity h5HT(7) ligands. Bioorg Med Chem Lett14:677-80 (2004) 5-hydroxytryptamine receptor 7
Name:5-hydroxytryptamine receptor 7
Type:G Protein-Coupled Receptor (GPCR)
Mol. Mass.:53573.08
Organism:Homo sapiens (Human)
Description:P34969
Residue:479
BDBM50139353
NameBDBM50139353
Synonyms:(2-tert-Butylsulfanyl-ethyl)-dimethyl-amine | CHEMBL158973
TypeSmall organic molecule
Emp. Form.C8H19NS
Mol. Mass.161.308
SMILESCN(C)CCSC(C)(C)C