Reaction Details
Target5-hydroxytryptamine receptor 7
LigandBDBM50139354
Substrate/Competitorn/a
Meas. Tech.ChEBML_3690
Ki 7.2±n/a nM
Citation Thomson, CGBeer, MSCurtis, NRDiggle, HJHandford, EKulagowski, JJ Thiazoles and thiopyridines: novel series of high affinity h5HT(7) ligands. Bioorg Med Chem Lett14:677-80 (2004) 5-hydroxytryptamine receptor 7
Name:5-hydroxytryptamine receptor 7
Type:G Protein-Coupled Receptor (GPCR)
Mol. Mass.:53573.08
Organism:Homo sapiens (Human)
Description:P34969
Residue:479
BDBM50139354
NameBDBM50139354
Synonyms:1-[6-(2-Dimethylamino-ethylsulfanyl)-pyridin-2-yl]-cyclohexanol | CHEMBL159143
TypeSmall organic molecule
Emp. Form.C15H24N2OS
Mol. Mass.280.429
SMILESCN(C)CCSc1cccc(n1)C1(O)CCCCC1