Reaction Details
Target5-hydroxytryptamine receptor 7
LigandBDBM50139356
Substrate/Competitorn/a
Meas. Tech.ChEBML_3690
Ki 27±n/a nM
Citation Thomson, CGBeer, MSCurtis, NRDiggle, HJHandford, EKulagowski, JJ Thiazoles and thiopyridines: novel series of high affinity h5HT(7) ligands. Bioorg Med Chem Lett14:677-80 (2004) 5-hydroxytryptamine receptor 7
Name:5-hydroxytryptamine receptor 7
Type:G Protein-Coupled Receptor (GPCR)
Mol. Mass.:53573.08
Organism:Homo sapiens (Human)
Description:P34969
Residue:479
BDBM50139356
NameBDBM50139356
Synonyms:CHEMBL350166 | Dimethyl-[2-(4-pyridin-4-yl-thiazol-2-ylsulfanyl)-ethyl]-amine
TypeSmall organic molecule
Emp. Form.C12H15N3S2
Mol. Mass.265.398
SMILESCN(C)CCSc1nc(cs1)-c1ccncc1