Reaction Details
TargetSodium-dependent serotonin transporter
LigandBDBM50139957
Substrate/Competitorn/a
Meas. Tech.ChEMBL_201479 (CHEMBL804588)
Ki 0.050±n/a nM
Citation Plisson, CMcConathy, JMartarello, LMalveaux, EJCamp, VMWilliams, LVotaw, JRGoodman, MM Synthesis, radiosynthesis, and biological evaluation of carbon-11 and iodine-123 labeled 2beta-carbomethoxy-3beta-[4'-((Z)-2-haloethenyl)phenyl]tropanes: candidate radioligands for in vivo imaging of the serotonin transporter. J Med Chem47:1122-35 (2004) 
 
Sodium-dependent serotonin transporter
Name:Sodium-dependent serotonin transporter
Type:Multi-pass membrane protein
Mol. Mass.:70322.51
Organism:Homo sapiens (Human)
Description:P31645
Residue:630
BDBM50139957
NameBDBM50139957
Synonyms:2beta-carbomethoxy-3beta-[4'-((Z)-2-iodoethenyl)phenyl]nortropane CHEMBL428706
TypeSmall organic molecule
Emp. Form.C17H20INO2
Mol. Mass.397.2507
SMILESCOC(=O)C1C2CCC(CC1c1ccc(\C=C/I)cc1)N2