Reaction Details
TargetSodium-dependent noradrenaline transporter
LigandBDBM50106857
Substrate/Competitorn/a
Meas. Tech.ChEMBL_144969 (CHEMBL753702)
Ki 7.5±n/a nM
Citation Plisson, CMcConathy, JMartarello, LMalveaux, EJCamp, VMWilliams, LVotaw, JRGoodman, MM Synthesis, radiosynthesis, and biological evaluation of carbon-11 and iodine-123 labeled 2beta-carbomethoxy-3beta-[4'-((Z)-2-haloethenyl)phenyl]tropanes: candidate radioligands for in vivo imaging of the serotonin transporter. J Med Chem47:1122-35 (2004) 
 
Sodium-dependent noradrenaline transporter
Name:Sodium-dependent noradrenaline transporter
Type:Multi-pass membrane protein
Mol. Mass.:69337.72
Organism:Homo sapiens (Human)
Description:P23975
Residue:617
BDBM50106857
NameBDBM50106857
Synonyms:3-(4-Iodo-phenyl)-8-aza-bicyclo[3.2.1]octane-2-carboxylic acid methyl ester | CHEMBL14613
TypeSmall organic molecule
Emp. Form.C15H18INO2
Mol. Mass.371.2134
SMILESCOC(=O)C1C2CCC(CC1c1ccc(I)cc1)N2