Reaction Details
TargetCannabinoid receptor 1
LigandBDBM50140223
Substrate/Competitorn/a
Meas. Tech.ChEBML_46467
Ki 78±n/a nM
Citation Dyck, BGoodfellow, VSPhillips, TGrey, JHaddach, MRowbottom, MNaeve, GSBrown, BSaunders, J Potent imidazole and triazole CB1 receptor antagonists related to SR141716. Bioorg Med Chem Lett14:1151-4 (2004) 
 
Cannabinoid receptor 1
Name:Cannabinoid receptor 1
Type:G Protein-Coupled Receptor (GPCR)
Mol. Mass.:52868.96
Organism:Homo sapiens (Human)
Description:P21554
Residue:472
BDBM50140223
NameBDBM50140223
Synonyms:1-(4-Chloro-phenyl)-2-(2,4-dichloro-phenyl)-1H-imidazole-4-carboxylic acid azepan-1-ylamide | CHEMBL15635
TypeSmall organic molecule
Emp. Form.C22H21Cl3N4O
Mol. Mass.463.787
SMILESClc1ccc(cc1)-n1cc(nc1-c1ccc(Cl)cc1Cl)C(=O)NN1CCCCCC1