Reaction Details
TargetCannabinoid receptor 1
LigandBDBM50140233
Substrate/Competitorn/a
Meas. Tech.ChEBML_46467
Ki 41±n/a nM
Citation Dyck, BGoodfellow, VSPhillips, TGrey, JHaddach, MRowbottom, MNaeve, GSBrown, BSaunders, J Potent imidazole and triazole CB1 receptor antagonists related to SR141716. Bioorg Med Chem Lett14:1151-4 (2004) 
 
Cannabinoid receptor 1
Name:Cannabinoid receptor 1
Type:G Protein-Coupled Receptor (GPCR)
Mol. Mass.:52868.96
Organism:Homo sapiens (Human)
Description:P21554
Residue:472
BDBM50140233
NameBDBM50140233
Synonyms:5-(4-Chloro-phenyl)-1-(2,4-dichloro-phenyl)-4-methyl-1H-pyrazole-3-carboxylic acid (1,2-dimethyl-propyl)-amide | CHEMBL15764
TypeSmall organic molecule
Emp. Form.C22H22Cl3N3O
Mol. Mass.450.789
SMILESCC(C)C(C)NC(=O)c1nn(c(c1C)-c1ccc(Cl)cc1)-c1ccc(Cl)cc1Cl