Reaction Details
TargetMelatonin receptor type 1B
LigandBDBM50452037
Substrate/Competitorn/a
Meas. Tech.ChEBML_105264
Ki 0.370000±n/a nM
Citation Sun, LQChen, JTakaki, KJohnson, GIben, LMahle, CDRyan, EXu, C Design and synthesis of benzoxazole derivatives as novel melatoninergic ligands. Bioorg Med Chem Lett14:1197-200 (2004) 
 
Melatonin receptor type 1B
Name:Melatonin receptor type 1B
Type:Enzyme
Mol. Mass.:40203.54
Organism:Homo sapiens (Human)
Description:P49286
Residue:362
BDBM50452037
NameBDBM50452037
Synonyms:CHEMBL2112700
TypeSmall organic molecule
Emp. Form.C23H26N2O2
Mol. Mass.362.4647
SMILESCC(=O)NC[C@@H]1C[C@H]1c1cccc2nc(CCCCc3ccccc3)oc12