Reaction Details
TargetMelatonin receptor type 1A
LigandBDBM50140294
Substrate/Competitorn/a
Meas. Tech.ChEBML_105100
Ki 3.5±n/a nM
Citation Sun, LQChen, JTakaki, KJohnson, GIben, LMahle, CDRyan, EXu, C Design and synthesis of benzoxazole derivatives as novel melatoninergic ligands. Bioorg Med Chem Lett14:1197-200 (2004) 
 
Melatonin receptor type 1A
Name:Melatonin receptor type 1A
Type:Enzyme
Mol. Mass.:39392.94
Organism:Homo sapiens (Human)
Description:P48039
Residue:350
BDBM50140294
NameBDBM50140294
Synonyms:1-Ethyl-3-[(1R,2R)-2-(2-propyl-2,3-dihydro-benzooxazol-7-yl)-cyclopropylmethyl]-urea | CHEMBL19109
TypeSmall organic molecule
Emp. Form.C17H25N3O2
Mol. Mass.303.3993
SMILESCCCC1Nc2cccc([C@@H]3C[C@H]3CNC(=O)NCC)c2O1