Reaction Details
TargetMelatonin receptor type 1B
LigandBDBM50140297
Substrate/Competitorn/a
Meas. Tech.ChEBML_105264
Ki 2.2±n/a nM
Citation Sun, LQChen, JTakaki, KJohnson, GIben, LMahle, CDRyan, EXu, C Design and synthesis of benzoxazole derivatives as novel melatoninergic ligands. Bioorg Med Chem Lett14:1197-200 (2004) 
 
Melatonin receptor type 1B
Name:Melatonin receptor type 1B
Type:Enzyme
Mol. Mass.:40203.54
Organism:Homo sapiens (Human)
Description:P49286
Residue:362
BDBM50140297
NameBDBM50140297
Synonyms:CHEMBL18846 | Cyclopropanecarboxylic acid [(1R,2R)-2-(2-isopropyl-2,3-dihydro-benzooxazol-7-yl)-cyclopropylmethyl]-amide
TypeSmall organic molecule
Emp. Form.C18H24N2O2
Mol. Mass.300.3954
SMILESCC(C)C1Nc2cccc([C@@H]3C[C@H]3CNC(=O)C3CC3)c2O1