Reaction Details
TargetMelatonin receptor type 1A
LigandBDBM50140306
Substrate/Competitorn/a
Meas. Tech.ChEBML_105100
Ki 1.3±n/a nM
Citation Sun, LQChen, JTakaki, KJohnson, GIben, LMahle, CDRyan, EXu, C Design and synthesis of benzoxazole derivatives as novel melatoninergic ligands. Bioorg Med Chem Lett14:1197-200 (2004) 
 
Melatonin receptor type 1A
Name:Melatonin receptor type 1A
Type:Enzyme
Mol. Mass.:39392.94
Organism:Homo sapiens (Human)
Description:P48039
Residue:350
BDBM50140306
NameBDBM50140306
Synonyms:CHEMBL19441 | N-[(1R,2R)-2-(2-Isopropyl-2,3-dihydro-benzooxazol-7-yl)-cyclopropylmethyl]-isobutyramide
TypeSmall organic molecule
Emp. Form.C18H26N2O2
Mol. Mass.302.4112
SMILESCC(C)C1Nc2cccc([C@@H]3C[C@H]3CNC(=O)C(C)C)c2O1