Reaction Details
TargetBaculoviral IAP repeat-containing protein 3
LigandBDBM50574939
Substrate/Competitorn/a
Meas. Tech.ChEMBL_2123718 (CHEMBL4832951)
IC50 5.0±n/a nM
Citation Miah, AHSmith, IEDRackham, MMares, AThawani, ARNagilla, RHaile, PAVotta, BJGordon, LJWatt, GDenyer, JFisher, DTDace, PGiffen, PGoncalves, AChurcher, IScott-Stevens, PHarling, JD Optimization of a Series of RIPK2 PROTACs. J Med Chem64:12978-13003 (2021) 
 
Baculoviral IAP repeat-containing protein 3
Name:Baculoviral IAP repeat-containing protein 3
Type:Protein
Mol. Mass.:68365.75
Organism:Homo sapiens (Human)
Description:Q13489
Residue:604
BDBM50574939
NameBDBM50574939
Synonyms:CHEMBL4870089
TypeSmall organic molecule
Emp. Form.C59H78FN15O6S
Mol. Mass.1144.411
SMILESC[C@@H]1CN(CC(=O)N2CC(C)(C)c3c2cc(Cc2ccc(F)cc2)c(=O)n3C)[C@@H](CN2CCN(C[C@H]2C)c2ncc(cn2)C(=O)N2CCN(CCCOc3cc4ncnc(Nc5n[nH]c(C)c5C)c4cc3S(=O)(=O)C(C)(C)C)CC2)CN1