Reaction Details
TargetEstrogen receptor beta
LigandBDBM19459
Substrate/Competitorn/a
Meas. Tech.ChEBML_67681
IC50 4±n/a nM
Citation Chen, HYDykstra, KDBirzin, ETFrisch, KChan, WYang, YTMosley, RTDiNinno, FRohrer, SPSchaeffer, JMHammond, ML Estrogen receptor ligands. Part 1: The discovery of flavanoids with subtype selectivity. Bioorg Med Chem Lett14:1417-21 (2004) 
 
Estrogen receptor beta
Name:Estrogen receptor beta
Type:Protein
Mol. Mass.:59238.43
Organism:Homo sapiens (Human)
Description:Q92731
Residue:530
BDBM19459
NameBDBM19459
Synonyms:5,7-dihydroxy-3-(4-hydroxyphenyl)-4H-chromen-4-one Genistein Genisteol US8552057, 2 | cid_5280961
TypePhytoestrogen
Emp. Form.C15H10O5
Mol. Mass.270.2369
SMILESOc1ccc(cc1)-c1coc2cc(O)cc(O)c2c1=O