Reaction Details
Target1-acyl-sn-glycerol-3-phosphate acyltransferase beta
LigandBDBM50141250
Substrate/Competitorn/a
Meas. Tech.ChEBML_100169
IC50 6±n/a nM
Citation Gong, BHong, FKohm, CBonham, LKlein, P Synthesis and SAR of 2-arylbenzoxazoles, benzothiazoles and benzimidazoles as inhibitors of lysophosphatidic acid acyltransferase-beta. Bioorg Med Chem Lett14:1455-9 (2004) 
 
1-acyl-sn-glycerol-3-phosphate acyltransferase beta
Name:1-acyl-sn-glycerol-3-phosphate acyltransferase beta
Type:PROTEIN
Mol. Mass.:30924.09
Organism:Homo sapiens (Human)
Description:ChEMBL_321473
Residue:278
BDBM50141250
NameBDBM50141250
Synonyms:CHEMBL34896 | [4-Chloro-3-(5-chloro-benzothiazol-2-yl)-phenyl]-carbamic acid prop-2-ynyl ester
TypeSmall organic molecule
Emp. Form.C17H10Cl2N2O2S
Mol. Mass.377.244
SMILESClc1ccc2sc(nc2c1)-c1cc(NC(=O)OCC#C)ccc1Cl